Uploaded image for project: 'CFEngine Community'
  1. CFEngine Community
  2. CFE-1566

old openssl version is not properly detected in configure script

    XMLWordPrintable

    Details

    • Type: Bug
    • Status: Open
    • Priority: Medium
    • Resolution: Unresolved
    • Affects Version/s: 3.6.0
    • Fix Version/s: None
    • Labels:
      None
    • Platform:
      Any

      Description

      As a result a bunch of undefined symbols show, and the message is cryptic. It should be more readable than now:

      <pre>
      CC tls_generic.lo
      In file included from ../libutils/json.h:103,
      from ../libpromises/cf3.defs.h:1446,
      from ../libpromises/files_hashes.h:28,
      from tls_generic.c:33:
      ../libutils/writer.h:57: warning: `warn_unused_result' attribute directive ignored
      tls_generic.c: In function `CompareCertToRSA':
      tls_generic.c:109: warning: implicit declaration of function `EVP_PKEY_cmp'
      tls_generic.c: In function `TLSGenerateCertFromPrivKey':
      tls_generic.c:439: warning: passing arg 4 of `X509_NAME_add_entry_by_txt' discards qualifiers from pointer target type
      tls_generic.c: In function `assert_SSLIsBlocking':
      tls_generic.c:561: warning: unused parameter `ssl'
      tls_generic.c: In function `TLSSetDefaultOptions':
      tls_generic.c:725: warning: implicit declaration of function `SSL_CTX_clear_options'
      tls_generic.c:735: error: `SSL_OP_NO_TICKET' undeclared (first use in this function)
      tls_generic.c:735: error: (Each undeclared identifier is reported only once
      tls_generic.c:735: error: for each function it appears in.)
      make[2]: *** [tls_generic.lo] Error 1
      make[1]: *** [all-recursive] Error 1
      make: *** [all] Error 2
      </pre>

        Attachments

          Activity

            People

            • Assignee:
              Unassigned
              Reporter:
              a10038 jimis (Dimitrios Apostolou)
            • Votes:
              0 Vote for this issue
              Watchers:
              0 Start watching this issue

              Dates

              • Created:
                Updated:

                Summary Panel