Uploaded image for project: 'CFEngine Community'
  1. CFEngine Community
  2. CFE-1964

Package promise failures in autorun tests for local build

    XMLWordPrintable

    Details

    • Type: Bug
    • Status: Done
    • Priority: Blocker
    • Resolution: Fixed
    • Affects Version/s: None
    • Fix Version/s: 3.7.0
    • Component/s: Promise type: packages
    • Labels:
      None
    • Platform:
      Debian
    • Found in version (details):
      This is on various branches of mine, but all up to date with master

      Description

      Building locally on my VM, I see <pre>
      ./17_packages/multiline_yum_check_update.cf FAIL (UNEXPECTED FAILURE)
      Makefile.testall:50: recipe for target '17_packages/multiline_yum_check_update.cf_rule' failed
      make[3]: [17_packages/multiline_yum_check_update.cf_rule] Error 1 (ignored)
      </pre> and <pre>
      ./promises/autorun.cf FAIL (UNEXPECTED FAILURE)
      Makefile.testall:50: recipe for target 'promises/autorun.cf_rule' failed
      make[3]: [promises/autorun.cf_rule] Error 1 (ignored)
      ./promises/autorun-D.cf FAIL (UNEXPECTED FAILURE)
      Makefile.testall:50: recipe for target 'promises/autorun-D.cf_rule' failed
      make[3]: [promises/autorun-D.cf_rule] Error 1 (ignored)
      ./promises/promises.cf FAIL (UNEXPECTED FAILURE)
      Makefile.testall:50: recipe for target 'promises/promises.cf_rule' failed
      make[3]: [promises/promises.cf_rule] Error 1 (ignored)
      </pre>

      I attach the masterfiles/tests/acceptance/test.

      {log,xml}

      Curiously, the test-suite.log contained no sign of any error or even any tests having been run; but it also dates from Apr 9 so I guess masterfiles acceptance tests no longer write this file !

        Attachments

          Activity

            People

            • Assignee:
              a10050 Edward Welbourne (Inactive)
              Reporter:
              a10050 Edward Welbourne (Inactive)
            • Votes:
              0 Vote for this issue
              Watchers:
              3 Start watching this issue

              Dates

              • Created:
                Updated:
                Resolved:

                Summary Panel